{"text_format":"1","workbook":"xlsx","n_sheets":11,"sheets":["Controls & Results","Assumptions","Construction CF","Model","Capital Costs","E&AS","ESI","PFP","Scarcity","MACRS","Depreciation"],"not_rendered":{"charts":0,"images":2,"macros":1,"external_links":1,"defined_names":55,"comments":2,"pivot_tables":0},"unopened":[],"bounds":{"document_bytes":16777216,"sheet_cells":100000,"rows_first":2000,"rows_last":500,"rows_between":2000,"halvings":0,"cell_chars":16384,"cell_head_chars":4096},"cells_cut":0,"cells_raw":0,"read":"whole","date_system":"1900"}

{"sheet":"Controls & Results","index":0,"n_rows":40,"n_cols":6,"rows_kept":40,"cut":false,"hidden":false,"merged":[]}
[null,null,null,null,null,"ISO-NE Public"]
[null,"Instructions",null,null,null,"Draft Values - Subject to Change"]
[null,"1. Choose reference technology from drop-down below"]
[null,"2. Choose Market Proposal"]
[null,"3. Click the \"Run Model\" button below. Macro MUST be run to get results."]
[]
[null,"Choose reference technology & market proposals:"]
[null,"Reference Technology",null,"Solar - ORTP"]
[null,"FRM Sunset or With FRM",null,"With FRM"]
[null,"ESI Proposal",null,"NEPOOL Proposal"]
{"$rows_left_out":31}
{"sheet":"Assumptions","index":1,"n_rows":60,"n_cols":15,"rows_kept":60,"cut":false,"hidden":false,"merged":[]}
[null,"Resource Assumptions"]
[]
[null,null,"CONE or ORTP:",{"$f":"RIGHT(D4,4)","v":"ORTP"},null,"CONE","CONE","CONE","ORTP","ORTP","ORTP","ORTP","ORTP","ORTP","ORTP"]
[null,null,"Reference Technology",{"$f":"'Controls & Results'!D8","v":"Solar - ORTP"}]
[null,null,null,{"$f":"MATCH('Controls & Results'!D8,F5:O5,0)","v":8},null,"CC - CONE","SC - CONE","Aero - CONE","CC - ORTP","SC - ORTP","Onshore Wind - ORTP","Offshore Wind - ORTP","Solar - ORTP","Battery - ORTP","Co-located Resource - ORTP"]
[null,null,null,null,null,"Combined Cycle","Simple Cycle","Aero","Combined Cycle","Simple Cycle"]
[null,null,null,null,null,"7HA 02 Combined Cycle","7HA 02 Simple Cycle","LM6000 PF+ (2 Units)","7HA 02 Combined Cycle","7HA 02 Simple Cycle"]
[null,"Line","Assumption"]
[null,"Plant"]
[null,{"$f":"MAX($B$9:B9)+1","v":1},"Location",{"$f":"OFFSET(F10,0,D$5-1)","v":"CT"},null,"CT","CT","CT","CT","CT","NH","MA","CT","RI","MA"]
{"$rows_left_out":51}
{"sheet":"Construction CF","index":2,"n_rows":49,"n_cols":51,"rows_kept":49,"cut":false,"hidden":false,"merged":[[2,1,2,2]]}
["Drawdown Schedule and Construction Cash Flow"]
[]
["Technology",{"$f":"'Controls & Results'!D8","v":"Solar - ORTP"}]
[]
[]
["Capital Draw Down Schedule"]
[null,null,{"$f":"EDATE(45809,-B8)","v":"2024-02-01"},{"$f":"EDATE(C7,1)","v":"2024-03-01"},{"$f":"EDATE(D7,1)","v":"2024-04-01"},"2024-05-01","2024-06-01","2024-07-01","2024-08-01","2024-09-01","2024-10-01","2024-11-01","2024-12-01","2025-01-01","2025-02-01","2025-03-01","2025-04-01","2025-05-01","2025-06-01","2025-07-01","2025-08-01","2025-09-01","2025-10-01","2025-11-01","2025-12-01","2026-01-01","2026-02-01","2026-03-01","2026-04-01","2026-05-01","2026-06-01","2026-07-01","2026-08-01","2026-09-01","2026-10-01","2026-11-01","2026-12-01","2027-01-01","2027-02-01","2027-03-01","2027-04-01","2027-05-01","2027-06-01","2027-07-01","2027-08-01","2027-09-01","2027-10-01","2027-11-01","2027-12-01","2028-01-01"]
["Month Count",{"$f":"COUNTIF(C8:AX8,1)","v":16},{"$f":"IF(OR(C10>0,SUM(C$10:$AX$10)>0),1,0)","v":1},{"$f":"IF(OR(D10>0,SUM(D$10:$AX$10)>0),1,0)","v":1},{"$f":"IF(OR(E10>0,SUM(E$10:$AX$10)>0),1,0)","v":1},{"$f":"IF(OR(F10>0,SUM(F$10:$AX$10)>0),1,0)","v":1},{"$f":"IF(OR(G10>0,SUM(G$10:$AX$10)>0),1,0)","v":1},{"$f":"IF(OR(H10>0,SUM(H$10:$AX$10)>0),1,0)","v":1},{"$f":"IF(OR(I10>0,SUM(I$10:$AX$10)>0),1,0)","v":1},{"$f":"IF(OR(J10>0,SUM(J$10:$AX$10)>0),1,0)","v":1},{"$f":"IF(OR(K10>0,SUM(K$10:$AX$10)>0),1,0)","v":1},{"$f":"IF(OR(L10>0,SUM(L$10:$AX$10)>0),1,0)","v":1},{"$f":"IF(OR(M10>0,SUM(M$10:$AX$10)>0),1,0)","v":1},{"$f":"IF(OR(N10>0,SUM(N$10:$AX$10)>0),1,0)","v":1},{"$f":"IF(OR(O10>0,SUM(O$10:$AX$10)>0),1,0)","v":1},{"$f":"IF(OR(P10>0,SUM(P$10:$AX$10)>0),1,0)","v":1},{"$f":"IF(OR(Q10>0,SUM(Q$10:$AX$10)>0),1,0)","v":1},{"$f":"IF(OR(R10>0,SUM(R$10:$AX$10)>0),1,0)","v":1},{"$f":"IF(OR(S10>0,SUM(S$10:$AX$10)>0),1,0)","v":0},{"$f":"IF(OR(T10>0,SUM(T$10:$AX$10)>0),1,0)","v":0},{"$f":"IF(OR(U10>0,SUM(U$10:$AX$10)>0),1,0)","v":0},{"$f":"IF(OR(V10>0,SUM(V$10:$AX$10)>0),1,0)","v":0},{"$f":"IF(OR(W10>0,SUM(W$10:$AX$10)>0),1,0)","v":0},{"$f":"IF(OR(X10>0,SUM(X$10:$AX$10)>0),1,0)","v":0},{"$f":"IF(OR(Y10>0,SUM(Y$10:$AX$10)>0),1,0)","v":0},{"$f":"IF(OR(Z10>0,SUM(Z$10:$AX$10)>0),1,0)","v":0},{"$f":"IF(OR(AA10>0,SUM(AA$10:$AX$10)>0),1,0)","v":0},{"$f":"IF(OR(AB10>0,SUM(AB$10:$AX$10)>0),1,0)","v":0},{"$f":"IF(OR(AC10>0,SUM(AC$10:$AX$10)>0),1,0)","v":0},{"$f":"IF(OR(AD10>0,SUM(AD$10:$AX$10)>0),1,0)","v":0},{"$f":"IF(OR(AE10>0,SUM(AE$10:$AX$10)>0),1,0)","v":0},{"$f":"IF(OR(AF10>0,SUM(AF$10:$AX$10)>0),1,0)","v":0},{"$f":"IF(OR(AG10>0,SUM(AG$10:$AX$10)>0),1,0)","v":0},{"$f":"IF(OR(AH10>0,SUM(AH$10:$AX$10)>0),1,0)","v":0},{"$f":"IF(OR(AI10>0,SUM(AI$10:$AX$10)>0),1,0)","v":0},{"$f":"IF(OR(AJ10>0,SUM(AJ$10:$AX$10)>0),1,0)","v":0},{"$f":"IF(OR(AK10>0,SUM(AK$10:$AX$10)>0),1,0)","v":0},{"$f":"IF(OR(AL10>0,SUM(AL$10:$AX$10)>0),1,0)","v":0},{"$f":"IF(OR(AM10>0,SUM(AM$10:$AX$10)>0),1,0)","v":0},{"$f":"IF(OR(AN10>0,SUM(AN$10:$AX$10)>0),1,0)","v":0},{"$f":"IF(OR(AO10>0,SUM(AO$10:$AX$10)>0),1,0)","v":0},{"$f":"IF(OR(AP10>0,SUM(AP$10:$AX$10)>0),1,0)","v":0},{"$f":"IF(OR(AQ10>0,SUM(AQ$10:$AX$10)>0),1,0)","v":0},{"$f":"IF(OR(AR10>0,SUM(AR$10:$AX$10)>0),1,0)","v":0},{"$f":"IF(OR(AS10>0,SUM(AS$10:$AX$10)>0),1,0)","v":0},{"$f":"IF(OR(AT10>0,SUM(AT$10:$AX$10)>0),1,0)","v":0},{"$f":"IF(OR(AU10>0,SUM(AU$10:$AX$10)>0),1,0)","v":0},{"$f":"IF(OR(AV10>0,SUM(AV$10:$AX$10)>0),1,0)","v":0},{"$f":"IF(OR(AW10>0,SUM(AW$10:$AX$10)>0),1,0)","v":0},{"$f":"IF(OR(AX10>0,SUM(AX$10:$AX$10)>0),1,0)","v":0}]
["Construction Month",null,1,2,3,4,5,6,7,8,9,10,11,12,13,14,15,16,17,18,19,20,21,22,23,24,25,26,27,28,29,30,31,32,33,34,35,36,37,38,39,40,41,42,43,44,45,46,47,48,"Total"]
["Capital Draw Down",null,{"$f":"OFFSET(C13,MATCH($B$3,$A$13:$A$22,0)-1,0)","v":0.04},0,0,0,0,0,0.15,0.08,0.1,0.3,0.08,0.05,0.05,0.05,0.05,0.05,0,0,0,0,0,0,0,0,0,0,0,0,0,0,0,0,0,0,0,0,0,0,0,0,0,0,0,0,0,0,0,0,{"$f":"SUM(C10:AX10)","v":1}]
{"$rows_left_out":40}
{"sheet":"Model","index":3,"n_rows":55,"n_cols":22,"rows_kept":55,"cut":false,"hidden":false,"merged":[]}
[]
[null,"Results",{"$f":"'Controls & Results'!D8","v":"Solar - ORTP"}]
[]
[null,"2025$","NPV","$/kW-yr","$/kW-mo"]
[null,"Revenue"]
[null,"Pay for Performance",{"$f":"NPV(Assumptions!$D$39,PFP!D6:W6)","v":1041337.7789787186},{"$f":"-PMT(Assumptions!$D$39,20,C6)/(Assumptions!$D$15*1000)","v":4.2936011532865681},{"$f":"D6/12","v":0.35780009610721403}]
[null,"Scarcity Adder",{"$f":"NPV(Assumptions!$D$39,Scarcity!D6:W6)","v":1629201.803429004},{"$f":"-PMT(Assumptions!$D$39,20,C7)/(Assumptions!$D$15*1000)","v":6.7174579500992868},{"$f":"D7/12","v":0.5597881625082739}]
[null,"E&AS",{"$f":"-PV(Assumptions!$D$39,20,'E&AS'!D6)","v":14454926.535860123},{"$f":"-PMT(Assumptions!$D$39,20,C8)/(Assumptions!$D$15*1000)","v":59.599959300343421},{"$f":"D8/12","v":4.9666632750286182}]
[null,"ESI",{"$f":"-PV(Assumptions!$D$39,20,ESI!D7)","v":32133.055969689187},{"$f":"-PMT(Assumptions!$D$39,20,C9)/(Assumptions!$D$15*1000)","v":0.13248969638400002},{"$f":"D9/12","v":1.1040808032000001E-2}]
[null,"REC",{"$f":"-PV(Assumptions!$D$39,20,(Assumptions!$D$20*Assumptions!$D$18*8760*Assumptions!$D$16))","v":10714365.185829576},{"$f":"-PMT(Assumptions!$D$39,20,C10)/(Assumptions!$D$15*1000)","v":44.177030399999985},3.6814191999999988]
{"$rows_left_out":46}
{"sheet":"Capital Costs","index":4,"n_rows":47,"n_cols":22,"rows_kept":47,"cut":false,"hidden":false,"merged":[[0,12,0,21]]}
["Capital Costs","2019$","2019$","2019$","2019$","2019$","2019$","2019$","2019$","2019$","2019$",null,"Constant$ At Beginning of Construction"]
[null,{"$f":"Assumptions!F$5","v":"CC - CONE"},{"$f":"Assumptions!G$5","v":"SC - CONE"},{"$f":"Assumptions!H$5","v":"Aero - CONE"},{"$f":"Assumptions!I$5","v":"CC - ORTP"},{"$f":"Assumptions!J$5","v":"SC - ORTP"},{"$f":"Assumptions!K$5","v":"Onshore Wind - ORTP"},{"$f":"Assumptions!L$5","v":"Offshore Wind - ORTP"},{"$f":"Assumptions!M$5","v":"Solar - ORTP"},{"$f":"Assumptions!N$5","v":"Battery - ORTP"},{"$f":"Assumptions!O$5","v":"Co-located Resource - ORTP"},null,{"$f":"B2","v":"CC - CONE"},"SC - CONE","Aero - CONE","CC - ORTP","SC - ORTP","Onshore Wind - ORTP","Offshore Wind - ORTP","Solar - ORTP","Battery - ORTP","Co-located Resource - ORTP"]
["Cost Component","7HA.02 Combined Cycle (CONE)","7HA.02 Simple Cycle (CONE)","LM6000 PF+","7HA.02 Combined Cycle (ORTP)","7HA.02 Simple Cycle (ORTP)","Onshore Wind (ORTP)","Offshore Wind","Solar","Battery","Co-located Resource","BLS PPI Escalation Rate","7HA.02 Combined Cycle (CONE)","7HA.02 Simple Cycle (CONE)","LM6000 PF+","7HA.02 Combined Cycle (ORTP)","7HA.02 Simple Cycle (ORTP)","Onshore Wind (ORTP)","Offshore Wind","Solar","Battery","Co-located Resource"]
["Construction Months",{"$f":"COUNTIF('Construction CF'!$C13:$AX13,\"<>\"&\"\")","v":28},{"$f":"COUNTIF('Construction CF'!$C14:$AX14,\"<>\"&\"\")","v":21},{"$f":"COUNTIF('Construction CF'!$C15:$AX15,\"<>\"&\"\")","v":17},{"$f":"COUNTIF('Construction CF'!$C16:$AX16,\"<>\"&\"\")","v":28},{"$f":"COUNTIF('Construction CF'!$C17:$AX17,\"<>\"&\"\")","v":21},{"$f":"COUNTIF('Construction CF'!$C18:$AX18,\"<>\"&\"\")","v":21},{"$f":"COUNTIF('Construction CF'!$C19:$AX19,\"<>\"&\"\")","v":48},{"$f":"COUNTIF('Construction CF'!$C20:$AX20,\"<>\"&\"\")","v":16},{"$f":"COUNTIF('Construction CF'!$C21:$AX21,\"<>\"&\"\")","v":17},{"$f":"COUNTIF('Construction CF'!$C22:$AX22,\"<>\"&\"\")","v":11}]
["Years to Escalate to Beginning of Construction",{"$f":"2025-(B4/12)-2019","v":3.6666666666667425},{"$f":"2025-(C4/12)-2019","v":4.25},4.5833333333332575,3.6666666666667425,4.25,4.25,2,4.6666666666667425,4.5833333333332575,5.0833333333332575,null,{"$f":"TEXT(EDATE(45809,-B$4),\"mmm yyyy\")&\" $\"","v":"Feb 2023 $"},"Sep 2023 $","Jan 2024 $","Feb 2023 $","Sep 2023 $","Sep 2023 $","Jun 2021 $","Feb 2024 $","Jan 2024 $","Jul 2024 $"]
[]
["EPC Costs",null,null,null,null,null,null,null,null,null,null,{"$f":"Assumptions!$D$52","v":7.0000000000000001E-3}]
["GRAND TOTAL CIVIL/ STRUCTURAL/ARCHITECTURAL",49040011.784212932,18868655.911483936,13966356.168497311,49040011.784212932,18868655.911483936,{"$f":"78450000+5625000","v":84075000},null,1291792.3967671543,423748.49237759615,613487.55990325764,null,{"$f":"B8*(1+$L$7)^B$5","v":50310498.966467708},{"$f":"C8*(1+$L$7)^C$5","v":19436417.291969832},{"$f":"D8*(1+$L$7)^D$5","v":14420097.158569347},{"$f":"E8*(1+$L$7)^E$5","v":50310498.966467708},19436417.291969832,86604832.452734441,0,{"$f":"I8*(1+$L$7)^I$5","v":1334535.875943861},{"$f":"J8*(1+$L$7)^J$5","v":437515.29440908338},{"$f":"K8*(1+$L$7)^K$5","v":635631.73112201598}]
["GRAND TOTAL MECHANICAL  COSTS",267032120.05606568,137734983.90110403,73833021.996722922,267032120.05606568,137734983.90110403,4300000,null,null,null,null,null,{"$f":"B9*(1+$L$7)^B$5","v":273950162.55724561},141879455.29152769,76231719.845798895,273950162.55724561,141879455.29152769,4429387.8031133879,0,0,{"$f":"J9*(1+$L$7)^J$5","v":0},{"$f":"K9*(1+$L$7)^K$5","v":0}]
["GRAND TOTAL ELECTRICAL/ INSTRUMENTATION AND  CONTROLS COST",54036721.760018192,27852487.407054689,19461005.723938562,54036721.760018192,27852487.407054689,11328780,null,1578383.7598560541,1293968.6502197757,531828.25791630568,null,55436659.481674112,28690573.955157507,20093257.67988503,55436659.481674112,28690573.955157507,11669665.106082533,0,{"$f":"I10*(1+$L$7)^I$5","v":1630610.1187826889},1336007.29003316,551024.89167385048]
{"$rows_left_out":38}
{"sheet":"E&AS","index":5,"n_rows":21,"n_cols":8,"rows_kept":21,"cut":false,"hidden":false,"merged":[]}
[null,"Energy & Ancillary Services Revenue"]
[]
[null,"Technology",null,{"$f":"'Controls & Results'!D8","v":"Solar - ORTP"}]
[]
[null,"Year",null,2025]
[null,"E&AS Revenue (2025$)","Availability",{"$f":"OFFSET(D9,MATCH($D$3,$B$9:$B$18,0)-1,0)","v":1191999.1860068685}]
[]
[null,null,null,null,null,null,"FRM Sunset","With FRM"]
[null,{"$f":"Assumptions!$F$5","v":"CC - CONE"},0.92769999999999997,{"$f":"C9*IF('Controls & Results'!$D$9=\"FRM Sunset\",G9,H9)","v":31515894.290583465}," ",null,33972075.337483525,{"$f":"G9","v":33972075.337483525}]
[null,{"$f":"Assumptions!$G$5","v":"SC - CONE"},0.98,{"$f":"C10*IF('Controls & Results'!$D$9=\"FRM Sunset\",G10,H10)","v":15418129.685336368},null,null,12850796.568385758,15732785.393200375]
{"$rows_left_out":12}
{"sheet":"ESI","index":6,"n_rows":27,"n_cols":15,"rows_kept":27,"cut":false,"hidden":false,"merged":[]}
[null,"Energy Security Improvement Revenue (ESI)"]
[]
[null,"Technology",null,{"$f":"'Controls & Results'!D8","v":"Solar - ORTP"},null,null,null," "," "," "]
[null,null,null,{"$f":"'Controls & Results'!D9","v":"With FRM"}]
[null,null,null,{"$f":"'Controls & Results'!D10","v":"NEPOOL Proposal"}]
[null,"Year",null,2025]
[null,"ESI Revenue (2025$)","MW",{"$f":"OFFSET(D10,MATCH($D$3,$B$10:$B$19,0)-1,0)","v":2649.7939276800003},null,null,null,"ESI Values Provided by ISO-NE"]
[null,null,null,null,null,null,null,"ISO-NE Proposal",{"$f":"H8","v":"ISO-NE Proposal"},"NEPOOL Proposal",{"$f":"J8","v":"NEPOOL Proposal"}]
[null,null,null,null,null,"Lookup Result",null,"FRM Sunset","With FRM","FRM Sunset","With FRM",null,null,"ISO ESI","NEPOOL ESI"]
[null,{"$f":"Assumptions!$F$5","v":"CC - CONE"},{"$f":"Assumptions!F15","v":557},{"$f":"F10*C10*12*1000","v":1475935.21771776},null,{"$f":"INDEX($H$10:$K$19,MATCH($B10,$B$10:$B$19,0),MATCH('Controls & Results'!$D$9,ESI!H$9:I$9,0)+MATCH('Controls & Results'!$D$10,ESI!$H$8:$K$8,0)-1)","v":0.22081616064000001},null,{"$f":"N13","v":0.32128751373119996},{"$f":"H10","v":0.32128751373119996},{"$f":"O13","v":0.22081616064000001},{"$f":"J10","v":0.22081616064000001},null,"Net CONE","2025$","2025$"]
{"$rows_left_out":18}
{"sheet":"PFP","index":7,"n_rows":45,"n_cols":23,"rows_kept":45,"cut":false,"hidden":false,"merged":[[2,2,2,3],[5,1,6,1]]}
[null,"Pay for Performance"]
[]
[null,"Technology",{"$f":"'Controls & Results'!D8","v":"Solar - ORTP"}]
[]
[null,"Year",null,2025,{"$f":"D5+1","v":2026},{"$f":"E5+1","v":2027},2028,2029,2030,2031,2032,2033,2034,2035,2036,2037,2038,2039,2040,2041,2042,2043,2044]
[null,"ICAP","ICAP: 2025$",{"$f":"D7/(1+Assumptions!$D$36)^(D5-2025)","v":99617.028000000006},{"$f":"E7/(1+Assumptions!$D$36)^(E5-2025)","v":97663.75294117647},{"$f":"F7/(1+Assumptions!$D$36)^(F5-2025)","v":95748.777393310273},{"$f":"G7/(1+Assumptions!$D$36)^(G5-2025)","v":93871.350385598314},{"$f":"H7/(1+Assumptions!$D$36)^(H5-2025)","v":92030.735672155206},{"$f":"I7/(1+Assumptions!$D$36)^(I5-2025)","v":90226.211443289416},{"$f":"J7/(1+Assumptions!$D$36)^(J5-2025)","v":88457.070042440595},{"$f":"K7/(1+Assumptions!$D$36)^(K5-2025)","v":86722.617688667262},{"$f":"L7/(1+Assumptions!$D$36)^(L5-2025)","v":85022.174204575742},{"$f":"M7/(1+Assumptions!$D$36)^(M5-2025)","v":83355.072749584069},{"$f":"N7/(1+Assumptions!$D$36)^(N5-2025)","v":81720.659558415748},{"$f":"O7/(1+Assumptions!$D$36)^(O5-2025)","v":80118.293684721328},{"$f":"P7/(1+Assumptions!$D$36)^(P5-2025)","v":78547.346749726785},{"$f":"Q7/(1+Assumptions!$D$36)^(Q5-2025)","v":77007.202695810585},{"$f":"R7/(1+Assumptions!$D$36)^(R5-2025)","v":75497.257544912325},{"$f":"S7/(1+Assumptions!$D$36)^(S5-2025)","v":74016.919161678772},{"$f":"T7/(1+Assumptions!$D$36)^(T5-2025)","v":72565.607021253687},{"$f":"U7/(1+Assumptions!$D$36)^(U5-2025)","v":71142.751981621259},{"$f":"V7/(1+Assumptions!$D$36)^(V5-2025)","v":69747.796060413006},{"$f":"W7/(1+Assumptions!$D$36)^(W5-2025)","v":68380.192216091178}]
[null,null,"ICAP: Nominal",{"$f":"OFFSET(D11,MATCH($C$3,$B$11:$B$20,0)-1,0)","v":99617.028000000006},99617.028000000006,99617.028000000006,99617.028000000006,99617.028000000006,99617.028000000006,99617.028000000006,99617.028000000006,99617.028000000006,99617.028000000006,99617.028000000006,99617.028000000006,99617.028000000006,99617.028000000006,99617.028000000006,99617.028000000006,99617.028000000006,99617.028000000006,99617.028000000006,99617.028000000006]
[]
[]
[null,null,"Plant Capacity (MW)"]
{"$rows_left_out":36}
{"sheet":"Scarcity","index":8,"n_rows":43,"n_cols":23,"rows_kept":43,"cut":false,"hidden":false,"merged":[[2,2,2,3],[5,1,6,1]]}
[null,"Scarcity Adder"]
[]
[null,"Technology",{"$f":"'Controls & Results'!D8","v":"Solar - ORTP"}]
[]
[null,"Year",null,2025,{"$f":"D5+1","v":2026},{"$f":"E5+1","v":2027},2028,2029,2030,2031,2032,2033,2034,2035,2036,2037,2038,2039,2040,2041,2042,2043,2044]
[null,"ICAP","ICAP: 2025$",{"$f":"D7/(1+Assumptions!$D$36)^(D5-2025)","v":155853.59999999998},{"$f":"E7/(1+Assumptions!$D$36)^(E5-2025)","v":152797.6470588235},{"$f":"F7/(1+Assumptions!$D$36)^(F5-2025)","v":149801.61476355247},{"$f":"G7/(1+Assumptions!$D$36)^(G5-2025)","v":146864.32819956125},{"$f":"H7/(1+Assumptions!$D$36)^(H5-2025)","v":143984.6354897659},{"$f":"I7/(1+Assumptions!$D$36)^(I5-2025)","v":141161.40734290777},{"$f":"J7/(1+Assumptions!$D$36)^(J5-2025)","v":138393.53661069387},{"$f":"K7/(1+Assumptions!$D$36)^(K5-2025)","v":135679.93785362146},{"$f":"L7/(1+Assumptions!$D$36)^(L5-2025)","v":133019.54691531515},{"$f":"M7/(1+Assumptions!$D$36)^(M5-2025)","v":130411.32050521094},{"$f":"N7/(1+Assumptions!$D$36)^(N5-2025)","v":127854.23578942248},{"$f":"O7/(1+Assumptions!$D$36)^(O5-2025)","v":125347.28998962991},{"$f":"P7/(1+Assumptions!$D$36)^(P5-2025)","v":122889.49998983322},{"$f":"Q7/(1+Assumptions!$D$36)^(Q5-2025)","v":120479.9019508169},{"$f":"R7/(1+Assumptions!$D$36)^(R5-2025)","v":118117.55093217341},{"$f":"S7/(1+Assumptions!$D$36)^(S5-2025)","v":115801.52052173867},{"$f":"T7/(1+Assumptions!$D$36)^(T5-2025)","v":113530.9024722928},{"$f":"U7/(1+Assumptions!$D$36)^(U5-2025)","v":111304.80634538509},{"$f":"V7/(1+Assumptions!$D$36)^(V5-2025)","v":109122.35916214225},{"$f":"W7/(1+Assumptions!$D$36)^(W5-2025)","v":106982.70506092378}]
[null,null,"ICAP: Nominal",{"$f":"OFFSET(D11,MATCH($C$3,$B$11:$B$20,0)-1,0)","v":155853.59999999998},155853.59999999998,155853.59999999998,155853.59999999998,155853.59999999998,155853.59999999998,155853.59999999998,155853.59999999998,155853.59999999998,155853.59999999998,155853.59999999998,155853.59999999998,155853.59999999998,155853.59999999998,155853.59999999998,155853.59999999998,155853.59999999998,155853.59999999998,155853.59999999998,155853.59999999998]
[]
[]
[null,null,"Plant Capacity (MW)"]
{"$rows_left_out":34}
{"sheet":"MACRS","index":9,"n_rows":17,"n_cols":34,"rows_kept":17,"cut":false,"hidden":false,"merged":[[2,2,2,3]]}
[null,"MACRS"]
[]
[null,"Technology",{"$f":"'Controls & Results'!D8","v":"Solar - ORTP"}]
[]
[null,"Depreciation Schedule",{"$f":"Assumptions!D26","v":"5yrMACRS"}]
[]
[]
[null,null,"Year",2025,{"$f":"D8+1","v":2026},{"$f":"E8+1","v":2027},2028,2029,2030,2031,2032,2033,2034,2035,2036,2037,2038,2039,2040,2041,2042,2043,2044,2045,2046,2047,2048,2049,2050,2051,2052,2053,2054]
[null,null,"Depreciation Schedule",{"$f":"OFFSET(D11,MATCH($C$5,$C$12:$C$17,0),0)","v":0.2},0.32,0.192,0.1152,0.1152,5.7599999999999998E-2,0,0,0,0,0,0,0,0,0,0,0,0,0,0,0,0,0,0,0,0,0,0,0,0]
[]
{"$rows_left_out":8}
{"sheet":"Depreciation","index":10,"n_rows":79,"n_cols":22,"rows_kept":79,"cut":false,"hidden":false,"merged":[]}
[null,"Depreciation"]
[null,null,2025,{"$f":"C2+1","v":2026},{"$f":"D2+1","v":2027},2028,2029,2030,2031,2032,2033,2034,2035,2036,2037,2038,2039,2040,2041,{"$f":"S2+1","v":2042},2043,2044]
[null,"Depreciation Rate",{"$f":"MACRS!D9","v":0.2},{"$f":"MACRS!E9","v":0.32},{"$f":"MACRS!F9","v":0.192},{"$f":"MACRS!G9","v":0.1152},{"$f":"MACRS!H9","v":0.1152},{"$f":"MACRS!I9","v":5.7599999999999998E-2},{"$f":"MACRS!J9","v":0},{"$f":"MACRS!K9","v":0},{"$f":"MACRS!L9","v":0},{"$f":"MACRS!M9","v":0},{"$f":"MACRS!N9","v":0},{"$f":"MACRS!O9","v":0},{"$f":"MACRS!P9","v":0},{"$f":"MACRS!Q9","v":0},{"$f":"MACRS!R9","v":0},{"$f":"MACRS!S9","v":0},{"$f":"MACRS!T9","v":0},{"$f":"MACRS!U9","v":0},{"$f":"MACRS!V9","v":0},{"$f":"MACRS!W9","v":0}]
[]
[null,"CAPEX SCHEDULE",0,0,0,0,0,0,0,0,0,0,0,0,0,0,0,0,0,0,0,0]
[]
[null,"Beginning Plant (2025$)",{"$f":"'Construction CF'!B48","v":31375235.788010698}]
[null,"ITC Reduced Plant Basis",{"$f":"C7*(1-Assumptions!$D$21/2)","v":29806473.998610161}]
[null,"Bonus Depreciation",{"$f":"Assumptions!$D$27*Depreciation!C8","v":11922589.599444065}]
[null,"Beginning Plant MACRS",{"$f":"C7-C9","v":19452646.188566633}]
{"$rows_left_out":69}