{"text_format":"1","workbook":"xlsx","n_sheets":15,"sheets":["ORTP Summary","BLS","BB LCOE","RECs","ICE","Controls & Results","Assumptions","Construction CF","Model","Capital Costs","E&AS","PFP","Scarcity","MACRS","Depreciation"],"not_rendered":{"charts":0,"images":3,"macros":1,"external_links":1,"defined_names":56,"comments":2,"pivot_tables":0},"unopened":[],"bounds":{"document_bytes":16777216,"sheet_cells":100000,"rows_first":2000,"rows_last":500,"rows_between":2000,"halvings":0,"cell_chars":16384,"cell_head_chars":4096},"cells_cut":0,"cells_raw":0,"read":"whole","date_system":"1900"}

{"sheet":"ORTP Summary","index":0,"n_rows":26,"n_cols":7,"rows_kept":26,"cut":false,"hidden":false,"merged":[[4,1,4,6],[2,1,2,6]]}
[]
[]
[null,"ISO-NE PUBLIC"]
[]
[null,"Summary of 2026-2027 ORTPs"]
[]
[]
[null,"Reference","CT","CC","Onshore Wind","Solar","Battery"]
[null,"Total Plant Capital Cost ($MM)",{"$f":"319765785.874606/1000000","v":319.76578587460602},{"$f":"599104967.944856/1000000","v":599.10496794485607},{"$f":"179859959.048784/1000000","v":179.85995904878399},{"$f":"27630352.5825819/1000000","v":27.630352582581899},{"$f":"136989533.994627/1000000","v":136.98953399462701}]
[null,"Gross CONE ($/kW-mo installed)",9.5045528472199834,13.168364771204683,18.50448690341576,8.943772631943137,8.5129501878440674]
{"$rows_left_out":17}
{"sheet":"BLS","index":1,"n_rows":77,"n_cols":9,"rows_kept":77,"cut":false,"hidden":false,"merged":[[0,0,0,12]]}
["PPI Commodity Data"]
[]
["Series Title","PPI Commodity data for Machinery and equipment-General purpose machinery and equipment, not seasonally adjusted"]
["Series ID","WPU114"]
["Seasonality","Not Seasonally Adjusted",null,null,null,null,null,null,"(1) For the simple cycle combustion turbine and combined cycle gas turbine technology types, each line item associated with capital costs that is included in the capital budgeting model will be updated to reflect changes in the Bureau of Labor Statistics Producer Price Index for Machinery and Equipment: General Purpose Machinery and Equipment (WPU114)."]
["Survey Name","PPI Commodity Data"]
["Measure Data Type","General purpose machinery and equipment"]
["Sector","Machinery and equipment"]
["Item","General purpose machinery and equipment"]
[]
{"$rows_left_out":68}
{"sheet":"BB LCOE","index":2,"n_rows":12,"n_cols":17,"rows_kept":12,"cut":false,"hidden":false,"merged":[[0,0,1,0],[0,1,1,16]]}
["Multiplier","LCOE per Technology Type (2019$/MWh), US Market"]
[]
[null,"Technology","2021-06-30","2020-12-31","2020-06-30","2019-12-31","2019-06-30","2018-12-31","2018-06-30","2017-12-31","2017-06-30","2016-12-31","2016-06-30","2015-12-31","2015-06-30","2014-12-31","2014-06-30"]
[{"$f":"AVERAGE(D4,C4)/AVERAGE(E4,F4)","v":0.90370227745152265},"PV non-tracking",38.870412000000002,45.696772000000003,45.103814999999997,48.474773999999996,54.598790999999999,56.851199999999999,54.820799999999998,62.247723999999998,69.674648000000005,83.481566000000001,92.530683999999994,115.302812,143.08556799999999,147.99193600000001,144.950164]
[{"$f":"C5/D5","v":0.93410989992234716},"Utility-scale battery",118.516293,126.876177]
[{"$f":"AVERAGE(D6,C6)/AVERAGE(E6,F6)","v":0.9862802609812451},"Wind onshore",35.894683999999998,36.719352999999998,37.232002999999999,36.392138000000003,37.722800999999997,39.592799999999997,40.607999999999997,46.821962999999997,53.035926000000003,59.887554999999999,69.479269000000002,71.756243999999995,72.655073999999999,84.008206999999999,113.292243]
[]
[]
[]
[]
{"$rows_left_out":3}
{"sheet":"RECs","index":3,"n_rows":234,"n_cols":6,"rows_kept":234,"cut":false,"hidden":false,"merged":[[532,0,533,5],[534,0,537,5]]}
[]
["Renewable Energy Credits (Data)"]
["Historical Period:  10 Years"]
["Location: MA Class I"]
["Instrument: All"]
["Inflation",0.02]
["2026$ 5-year Average",{"$f":"AVERAGE(B9:F9)","v":39.701822231072057}]
["Inflation adjustment to CCP dollar year",2026]
["2026$ Average",{"$f":"B10*(1+$B$6)^($B$8-B11)","v":38.53246248},{"$f":"C10*(1+$B$6)^($B$8-C11)","v":41.931326848412908},45.416547853099203,{"$f":"E10*(1+$B$6)^($B$8-E11)","v":44.723123481537876},27.905650492310279]
["Nominal Average",{"$f":"AVERAGE(B13:B227)","v":36.31},{"$f":"AVERAGE(C13:C227)","v":38.738064516129036},{"$f":"AVERAGE(D13:D227)","v":41.13516666666667},{"$f":"AVERAGE(E13:E227)","v":39.712853773584925},{"$f":"AVERAGE(F13:F227)","v":24.293548076923091}]
{"$rows_left_out":225}
{"sheet":"ICE","index":4,"n_rows":100,"n_cols":14,"rows_kept":100,"cut":false,"hidden":false,"merged":[]}
["Futures Contracts As Of…"]
[null,"2020-08-31",null,null,null,null,null,null,"2021-02-07"]
[null,null,"a","b","a+b = c","d","e = d/c",null,null,"a","b","a+b = c","d","e = d/c"]
[null,null,"Henry Hub (H)","Algonquin CG Basis (ALQ)","Algonquin CG Delivered","MA Hub On-Peak (NEP)","Ratio",null,null,"Henry Hub (H)","Algonquin CG Basis (ALQ)","Algonquin CG Delivered","MA Hub On-Peak (NEP)","Ratio"]
[null,null,"($/MMBtu)","($/MMBtu)","($/MMBtu)","($/MWh)",null,null,null,"($/MMBtu)","($/MMBtu)","($/MMBtu)","($/MWh)"]
[null,"2024-06-01",2.3370000000000002,-9.7500000000000003E-2,{"$f":"C6+D6","v":2.2395},30.5,{"$f":"F6/E6","v":13.619111408796606},null,"2026-06-01",2.919,-0.41249999999999998,{"$f":"J6+K6","v":2.5065},38.200000000000003,{"$f":"M6/L6","v":15.240375024935171}]
[null,"2024-07-01",2.3780000000000001,0.08,{"$f":"C7+D7","v":2.4580000000000002},36.5,{"$f":"F7/E7","v":14.84947111472742},null,"2026-07-01",2.968,-0.23,{"$f":"J7+K7","v":2.738},49.55,{"$f":"M7/L7","v":18.097151205259312}]
[null,"2024-08-01",2.387,1.4999999999999999E-2,2.4020000000000001,34.450000000000003,14.342214820982514,null,"2026-08-01",2.9830000000000001,-0.3,2.6830000000000003,46.3,17.256802087215799]
[null,"2024-09-01",2.3820000000000001,-0.33500000000000002,2.0470000000000002,30.95,15.119687347337566,null,"2026-09-01",2.9809999999999999,-0.65,2.331,37.799999999999997,16.216216216216214]
[null,"2024-10-01",2.4129999999999998,-0.13,2.2829999999999999,31.1,13.622426631625055,null,"2026-10-01",3.0209999999999999,-0.44500000000000001,2.5760000000000001,38.85,15.081521739130435]
{"$rows_left_out":91}
{"sheet":"Controls & Results","index":5,"n_rows":38,"n_cols":7,"rows_kept":38,"cut":false,"hidden":false,"merged":[]}
[null,null,null,null,null,"ISO-NE Public"]
[null,"Instructions",null,null,null,"Annually Updated Values  - post Net CONE & ORTP Order, June 2021"]
[null,"1. Choose reference technology from drop-down below",null,null,null,null,"Annual Updates - to be updated annually by ISO-NE"]
[null,"2. Choose Market Proposal"]
[null,"3. Click the \"Run Model\" button below. Macro MUST be run to get results."]
[]
[null,"Choose reference technology & market proposals:"]
[null,"Reference Technology",null,"Battery - ORTP"]
[null,"With FRM",null,"With FRM"]
[]
{"$rows_left_out":29}
{"sheet":"Assumptions","index":6,"n_rows":60,"n_cols":12,"rows_kept":60,"cut":false,"hidden":false,"merged":[]}
[null,"Resource Assumptions"]
[]
[null,null,"CONE or ORTP:",{"$f":"RIGHT(D4,4)","v":"ORTP"},null,"ORTP","ORTP","ORTP","ORTP","ORTP","ORTP","ORTP"]
[null,null,"Reference Technology",{"$f":"'Controls & Results'!D8","v":"Battery - ORTP"}]
[null,null,null,{"$f":"MATCH('Controls & Results'!D8,F5:L5,0)","v":6},null,"CC - ORTP","SC - ORTP","Onshore Wind - ORTP","Offshore Wind - ORTP","Solar - ORTP","Battery - ORTP","Co-located Resource - ORTP"]
[null,null,null,null,null,"Combined Cycle","Simple Cycle"]
[null,null,null,null,null,"7HA 02 Combined Cycle","7HA 02 Simple Cycle"]
[null,"Line","Assumption"]
[null,"Plant"]
[null,{"$f":"MAX($B$9:B9)+1","v":1},"Location",{"$f":"OFFSET(F10,0,D$5-1)","v":"RI"},null,"CT","CT","NH","MA","CT","RI","MA"]
{"$rows_left_out":51}
{"sheet":"Construction CF","index":7,"n_rows":46,"n_cols":51,"rows_kept":46,"cut":false,"hidden":false,"merged":[[2,1,2,2]]}
["Drawdown Schedule and Construction Cash Flow"]
[]
["Technology",{"$f":"'Controls & Results'!D8","v":"Battery - ORTP"}]
[]
[]
["Capital Draw Down Schedule"]
[null,null,{"$f":"EDATE(45809,-B8+24)","v":"2026-01-01"},{"$f":"EDATE(C7,1)","v":"2026-02-01"},{"$f":"EDATE(D7,1)","v":"2026-03-01"},"2026-04-01","2026-05-01","2026-06-01","2026-07-01","2026-08-01","2026-09-01","2026-10-01","2026-11-01","2026-12-01","2027-01-01","2027-02-01","2027-03-01","2027-04-01","2027-05-01","2027-06-01","2027-07-01","2027-08-01","2027-09-01","2027-10-01","2027-11-01","2027-12-01","2028-01-01","2028-02-01","2028-03-01","2028-04-01","2028-05-01","2028-06-01","2028-07-01","2028-08-01","2028-09-01","2028-10-01","2028-11-01","2028-12-01","2029-01-01","2029-02-01","2029-03-01","2029-04-01","2029-05-01","2029-06-01","2029-07-01","2029-08-01","2029-09-01","2029-10-01","2029-11-01","2029-12-01"]
["Month Count",{"$f":"COUNTIF(C8:AX8,1)","v":17},{"$f":"IF(OR(C10>0,SUM(C$10:$AX$10)>0),1,0)","v":1},{"$f":"IF(OR(D10>0,SUM(D$10:$AX$10)>0),1,0)","v":1},{"$f":"IF(OR(E10>0,SUM(E$10:$AX$10)>0),1,0)","v":1},{"$f":"IF(OR(F10>0,SUM(F$10:$AX$10)>0),1,0)","v":1},{"$f":"IF(OR(G10>0,SUM(G$10:$AX$10)>0),1,0)","v":1},{"$f":"IF(OR(H10>0,SUM(H$10:$AX$10)>0),1,0)","v":1},{"$f":"IF(OR(I10>0,SUM(I$10:$AX$10)>0),1,0)","v":1},{"$f":"IF(OR(J10>0,SUM(J$10:$AX$10)>0),1,0)","v":1},{"$f":"IF(OR(K10>0,SUM(K$10:$AX$10)>0),1,0)","v":1},{"$f":"IF(OR(L10>0,SUM(L$10:$AX$10)>0),1,0)","v":1},{"$f":"IF(OR(M10>0,SUM(M$10:$AX$10)>0),1,0)","v":1},{"$f":"IF(OR(N10>0,SUM(N$10:$AX$10)>0),1,0)","v":1},{"$f":"IF(OR(O10>0,SUM(O$10:$AX$10)>0),1,0)","v":1},{"$f":"IF(OR(P10>0,SUM(P$10:$AX$10)>0),1,0)","v":1},{"$f":"IF(OR(Q10>0,SUM(Q$10:$AX$10)>0),1,0)","v":1},{"$f":"IF(OR(R10>0,SUM(R$10:$AX$10)>0),1,0)","v":1},{"$f":"IF(OR(S10>0,SUM(S$10:$AX$10)>0),1,0)","v":1},{"$f":"IF(OR(T10>0,SUM(T$10:$AX$10)>0),1,0)","v":0},{"$f":"IF(OR(U10>0,SUM(U$10:$AX$10)>0),1,0)","v":0},{"$f":"IF(OR(V10>0,SUM(V$10:$AX$10)>0),1,0)","v":0},{"$f":"IF(OR(W10>0,SUM(W$10:$AX$10)>0),1,0)","v":0},{"$f":"IF(OR(X10>0,SUM(X$10:$AX$10)>0),1,0)","v":0},{"$f":"IF(OR(Y10>0,SUM(Y$10:$AX$10)>0),1,0)","v":0},{"$f":"IF(OR(Z10>0,SUM(Z$10:$AX$10)>0),1,0)","v":0},{"$f":"IF(OR(AA10>0,SUM(AA$10:$AX$10)>0),1,0)","v":0},{"$f":"IF(OR(AB10>0,SUM(AB$10:$AX$10)>0),1,0)","v":0},{"$f":"IF(OR(AC10>0,SUM(AC$10:$AX$10)>0),1,0)","v":0},{"$f":"IF(OR(AD10>0,SUM(AD$10:$AX$10)>0),1,0)","v":0},{"$f":"IF(OR(AE10>0,SUM(AE$10:$AX$10)>0),1,0)","v":0},{"$f":"IF(OR(AF10>0,SUM(AF$10:$AX$10)>0),1,0)","v":0},{"$f":"IF(OR(AG10>0,SUM(AG$10:$AX$10)>0),1,0)","v":0},{"$f":"IF(OR(AH10>0,SUM(AH$10:$AX$10)>0),1,0)","v":0},{"$f":"IF(OR(AI10>0,SUM(AI$10:$AX$10)>0),1,0)","v":0},{"$f":"IF(OR(AJ10>0,SUM(AJ$10:$AX$10)>0),1,0)","v":0},{"$f":"IF(OR(AK10>0,SUM(AK$10:$AX$10)>0),1,0)","v":0},{"$f":"IF(OR(AL10>0,SUM(AL$10:$AX$10)>0),1,0)","v":0},{"$f":"IF(OR(AM10>0,SUM(AM$10:$AX$10)>0),1,0)","v":0},{"$f":"IF(OR(AN10>0,SUM(AN$10:$AX$10)>0),1,0)","v":0},{"$f":"IF(OR(AO10>0,SUM(AO$10:$AX$10)>0),1,0)","v":0},{"$f":"IF(OR(AP10>0,SUM(AP$10:$AX$10)>0),1,0)","v":0},{"$f":"IF(OR(AQ10>0,SUM(AQ$10:$AX$10)>0),1,0)","v":0},{"$f":"IF(OR(AR10>0,SUM(AR$10:$AX$10)>0),1,0)","v":0},{"$f":"IF(OR(AS10>0,SUM(AS$10:$AX$10)>0),1,0)","v":0},{"$f":"IF(OR(AT10>0,SUM(AT$10:$AX$10)>0),1,0)","v":0},{"$f":"IF(OR(AU10>0,SUM(AU$10:$AX$10)>0),1,0)","v":0},{"$f":"IF(OR(AV10>0,SUM(AV$10:$AX$10)>0),1,0)","v":0},{"$f":"IF(OR(AW10>0,SUM(AW$10:$AX$10)>0),1,0)","v":0},{"$f":"IF(OR(AX10>0,SUM(AX$10:$AX$10)>0),1,0)","v":0}]
["Construction Month",null,1,2,3,4,5,6,7,8,9,10,11,12,13,14,15,16,17,18,19,20,21,22,23,24,25,26,27,28,29,30,31,32,33,34,35,36,37,38,39,40,41,42,43,44,45,46,47,48,"Total"]
["Capital Draw Down",null,{"$f":"OFFSET(C13,MATCH($B$3,$A$13:$A$19,0)-1,0)","v":0.02},{"$f":"OFFSET(D13,MATCH($B$3,$A$13:$A$19,0)-1,0)","v":0},0.2,0.05,0,0.02,0,0.02,0.2,0.02,0.2,0.02,0.02,0.02,7.4999999999999997E-2,7.4999999999999997E-2,0.06,0,0,0,0,0,0,0,0,0,0,0,0,0,0,0,0,0,0,0,0,0,0,0,0,0,0,0,0,0,0,0,{"$f":"SUM(C10:AX10)","v":1}]
{"$rows_left_out":37}
{"sheet":"Model","index":8,"n_rows":54,"n_cols":22,"rows_kept":54,"cut":false,"hidden":false,"merged":[]}
[]
[null,"Results",{"$f":"'Controls & Results'!D8","v":"Battery - ORTP"}]
[]
[null,null,"NPV","$/kW-yr","$/kW-mo"]
[null,"Revenue"]
[null,"Pay for Performance",{"$f":"NPV(Assumptions!$D$39,PFP!D8:W8)","v":22090232.79546684},{"$f":"-PMT(Assumptions!$D$39,20,C6)/(Assumptions!$D$15*1000)","v":11.123859416930236},{"$f":"D6/12","v":0.92698828474418626}]
[null,"Scarcity Adder",{"$f":"NPV(Assumptions!$D$39,Scarcity!D6:W6)","v":12339413.716936911},{"$f":"-PMT(Assumptions!$D$39,20,C7)/(Assumptions!$D$15*1000)","v":6.2136920305663068},{"$f":"D7/12","v":0.5178076692138589}]
[null,"E&AS",{"$f":"-PV(Assumptions!$D$39,20,'E&AS'!D6)","v":149633255.32001555},{"$f":"-PMT(Assumptions!$D$39,20,C8)/(Assumptions!$D$15*1000)","v":75.350011549858124},{"$f":"D8/12","v":6.2791676291548439}]
[null,"REC",{"$f":"-PV(Assumptions!$D$39,20,(Assumptions!$D$20*Assumptions!$D$18*8760*Assumptions!$D$16))","v":0},{"$f":"-PMT(Assumptions!$D$39,20,C9)/(Assumptions!$D$15*1000)","v":0},0]
[null,"Capacity Revenue",{"$f":"-PV(Assumptions!$D$39,20,(C34*12*1000*Assumptions!$D$15))","v":18801637.58037835},{"$f":"-PMT(Assumptions!$D$39,20,C10)/(Assumptions!$D$15*1000)","v":9.467839256774166},0.78898660473118054]
{"$rows_left_out":45}
{"sheet":"Capital Costs","index":9,"n_rows":47,"n_cols":20,"rows_kept":47,"cut":false,"hidden":false,"merged":[[0,13,0,19]]}
["Capital Costs","2019$","2019$","2019$","2019$","2019$","2019$","2019$",null,"CC & SC","Onshore Wind","Solar","Battery"]
[2025,{"$f":"Assumptions!F$5","v":"CC - ORTP"},{"$f":"Assumptions!G$5","v":"SC - ORTP"},{"$f":"Assumptions!H$5","v":"Onshore Wind - ORTP"},{"$f":"Assumptions!I$5","v":"Offshore Wind - ORTP"},{"$f":"Assumptions!J$5","v":"Solar - ORTP"},{"$f":"Assumptions!K$5","v":"Battery - ORTP"},{"$f":"Assumptions!L$5","v":"Co-located Resource - ORTP"},null,"BLS PPI WPU114","Bloomberg LCOE","Bloomberg LCOE","Bloomberg LCOE",{"$f":"B2","v":"CC - ORTP"},"SC - ORTP","Onshore Wind - ORTP","Offshore Wind - ORTP","Solar - ORTP","Battery - ORTP","Co-located Resource - ORTP"]
["Cost Component","7HA.02 Combined Cycle (ORTP)","7HA.02 Simple Cycle (ORTP)","Onshore Wind (ORTP)","Offshore Wind","Solar","Battery","Co-located Resource","BLS PPI Escalation Rate",null,null,null,null,"7HA.02 Combined Cycle (ORTP)","7HA.02 Simple Cycle (ORTP)","Onshore Wind (ORTP)","Offshore Wind","Solar","Battery","Co-located Resource"]
["Construction Months",{"$f":"COUNTIF('Construction CF'!$C13:$AX13,\"<>\"&\"\")","v":28},{"$f":"COUNTIF('Construction CF'!$C14:$AX14,\"<>\"&\"\")","v":21},{"$f":"COUNTIF('Construction CF'!$C15:$AX15,\"<>\"&\"\")","v":21},{"$f":"COUNTIF('Construction CF'!$C16:$AX16,\"<>\"&\"\")","v":48},{"$f":"COUNTIF('Construction CF'!$C17:$AX17,\"<>\"&\"\")","v":30},{"$f":"COUNTIF('Construction CF'!$C18:$AX18,\"<>\"&\"\")","v":17},{"$f":"COUNTIF('Construction CF'!$C19:$AX19,\"<>\"&\"\")","v":30}]
["Years to Escalate to Beginning of Construction",{"$f":"A2-(B4/12)-2019","v":3.6666666666667425},{"$f":"A2-(C4/12)-2019","v":4.25},{"$f":"A2-(D4/12)-2019","v":4.25},{"$f":"A2-(E4/12)-2019","v":2},{"$f":"A2-(F4/12)-2019","v":3.5},{"$f":"A2-(G4/12)-2019","v":4.5833333333332575},{"$f":"A2-(H4/12)-2019","v":3.5},null,null,null,null,null,{"$f":"TEXT(EDATE(45809,-B$4+24),\"mmm yyyy\")&\" $\"","v":"Feb 2025 $"},{"$f":"TEXT(EDATE(45809,-C$4+24),\"mmm yyyy\")&\" $\"","v":"Sep 2025 $"},{"$f":"TEXT(EDATE(45809,-D$4+24),\"mmm yyyy\")&\" $\"","v":"Sep 2025 $"},{"$f":"TEXT(EDATE(45809,-E$4+12),\"mmm yyyy\")&\" $\"","v":"Jun 2022 $"},{"$f":"TEXT(EDATE(45809,-F$4+24),\"mmm yyyy\")&\" $\"","v":"Dec 2024 $"},{"$f":"TEXT(EDATE(45809,-G$4+24),\"mmm yyyy\")&\" $\"","v":"Jan 2026 $"},{"$f":"TEXT(EDATE(45809,-H$4+12),\"mmm yyyy\")&\" $\"","v":"Dec 2023 $"}]
[]
["EPC Costs",null,null,null,null,null,null,null,{"$f":"Assumptions!$D$52","v":7.0000000000000001E-3}]
["Civil/Structural/Architectural",49040011.784212932,18868655.911483936,{"$f":"78450000+5625000","v":84075000},null,1291792.3967671543,423748.49237759615,613487.55990325764,null,{"$f":"BLS!$D$74","v":1.040694557934303},{"$f":"'BB LCOE'!$A$6","v":0.9862802609812451},{"$f":"'BB LCOE'!$A$4","v":0.90370227745152265},{"$f":"'BB LCOE'!$A$5","v":0.93410989992234716},{"$f":"B8*J8*(1+$I$7)^B$5","v":52357862.481362313},{"$f":"C8*$J8*(1+$I$7)^C$5","v":20227373.701493189},{"$f":"D8*K8*(1+$I$7)^D$5","v":85416636.753719941},{"$f":"E8*(1+$I$7)^E$5","v":0},{"$f":"F8*L8*(1+$I$7)^F$5","v":1196248.063498707},{"$f":"G8*M8*(1+$I$7)^G$5","v":408687.36787496513},{"$f":"H8*(1+$I$7)^H$5","v":628649.98222641379}]
["Mechanical Costs",267032120.05606568,137734983.90110403,4300000,null,null,null,null,null,{"$f":"BLS!$D$74","v":1.040694557934303},{"$f":"'BB LCOE'!$A$6","v":0.9862802609812451},{"$f":"'BB LCOE'!$A$4","v":0.90370227745152265},{"$f":"'BB LCOE'!$A$5","v":0.93410989992234716},285098443.3185432,147653177.00457612,4368617.7584418161,0,0,0,{"$f":"H9*(1+$I$7)^H$5","v":0}]
["Electrical/Instrumentation Costs",54036721.760018192,27852487.407054689,11328780,null,1578383.7598560541,1293968.6502197757,531828.25791630568,null,{"$f":"BLS!$D$74","v":1.040694557934303},{"$f":"'BB LCOE'!$A$6","v":0.9862802609812451},{"$f":"'BB LCOE'!$A$4","v":0.90370227745152265},{"$f":"'BB LCOE'!$A$5","v":0.93410989992234716},57692629.832635336,29858124.17914407,11509560.34639081,0,1461642.3822518827,1247977.6359884012,{"$f":"H10*(1+$I$7)^H$5","v":544972.46030434931}]
{"$rows_left_out":38}
{"sheet":"E&AS","index":10,"n_rows":18,"n_cols":9,"rows_kept":18,"cut":false,"hidden":false,"merged":[]}
[null,"Energy & Ancillary Services Revenue"]
[]
[null,"Technology",null,{"$f":"'Controls & Results'!D8","v":"Battery - ORTP"}]
[]
[null,"Year"]
[null,"E&AS Revenue","Availability",{"$f":"OFFSET(D9,MATCH($D$3,$B$9:$B$15,0)-1,0)","v":11302501.732478712}]
[null,null,null,null,null,null,null,"Annual Update EAS Multiplier"]
[null,null,null,null,null,null,"With FRM",null,"With FRM"]
[null,{"$f":"Assumptions!$F$5","v":"CC - ORTP"},{"$f":"PFP!F37","v":0.92769999999999997},{"$f":"C9*IF('Controls & Results'!$D$9=\"FRM Sunset\",#REF!,G9)","v":22465869.603583351},null,null,{"$f":"$H9*I9","v":24216739.898225021},{"$f":"ICE!$G$99","v":1.1575959727361886},20919855]
[null,{"$f":"Assumptions!$G$5","v":"SC - ORTP"},{"$f":"PFP!F38","v":0.98},{"$f":"C10*IF('Controls & Results'!$D$9=\"FRM Sunset\",#REF!,G10)","v":14051573.452712635},null,null,{"$f":"$H10*I10","v":14338340.257870035},{"$f":"ICE!$G$99","v":1.1575959727361886},12386308]
{"$rows_left_out":9}
{"sheet":"PFP","index":11,"n_rows":53,"n_cols":23,"rows_kept":53,"cut":false,"hidden":false,"merged":[[7,1,8,1]]}
[null,"Pay for Performance"]
[]
[null,"Technology",{"$f":"'Controls & Results'!D8","v":"Battery - ORTP"}]
[null,null,{"$f":"'Controls & Results'!D9","v":"With FRM"}]
[null,null,{"$f":"'Controls & Results'!#REF!","v":{"$error":"#REF!"}}]
[]
[null,"Year",null,2026,{"$f":"D7+1","v":2027},{"$f":"E7+1","v":2028},2029,2030,2031,2032,2033,2034,2035,2036,2037,2038,2039,2040,2041,2042,2043,2044,2045]
[null,"ICAP","ICAP: 2025$",{"$f":"D9/(1+Assumptions!$D$36)^(D7-$D$7)","v":1699707.4800000002},{"$f":"E9/(1+Assumptions!$D$36)^(E7-$D$7)","v":1666379.8823529414},{"$f":"F9/(1+Assumptions!$D$36)^(F7-$D$7)","v":1633705.7670126876},{"$f":"G9/(1+Assumptions!$D$36)^(G7-$D$7)","v":1699707.4800000004},{"$f":"H9/(1+Assumptions!$D$36)^(H7-$D$7)","v":1666379.8823529417},{"$f":"I9/(1+Assumptions!$D$36)^(I7-$D$7)","v":1633705.7670126879},{"$f":"J9/(1+Assumptions!$D$36)^(J7-$D$7)","v":1699707.4800000002},{"$f":"K9/(1+Assumptions!$D$36)^(K7-$D$7)","v":1666379.8823529417},{"$f":"L9/(1+Assumptions!$D$36)^(L7-$D$7)","v":1633705.7670126879},{"$f":"M9/(1+Assumptions!$D$36)^(M7-$D$7)","v":1699707.4800000004},{"$f":"N9/(1+Assumptions!$D$36)^(N7-$D$7)","v":1666379.8823529414},{"$f":"O9/(1+Assumptions!$D$36)^(O7-$D$7)","v":1633705.7670126881},{"$f":"P9/(1+Assumptions!$D$36)^(P7-$D$7)","v":1699707.4800000002},{"$f":"Q9/(1+Assumptions!$D$36)^(Q7-$D$7)","v":1666379.8823529414},{"$f":"R9/(1+Assumptions!$D$36)^(R7-$D$7)","v":1633705.7670126876},{"$f":"S9/(1+Assumptions!$D$36)^(S7-$D$7)","v":1699707.4800000007},{"$f":"T9/(1+Assumptions!$D$36)^(T7-$D$7)","v":1666379.8823529417},{"$f":"U9/(1+Assumptions!$D$36)^(U7-$D$7)","v":1633705.7670126876},{"$f":"V9/(1+Assumptions!$D$36)^(V7-$D$7)","v":1699707.4800000002},{"$f":"W9/(1+Assumptions!$D$36)^(W7-$D$7)","v":1666379.8823529414}]
[null,null,"ICAP: Nominal",{"$f":"OFFSET(D13,MATCH($C$3,$B$13:$B$19,0)-1,0)","v":1699707.4800000002},{"$f":"OFFSET(E13,MATCH($C$3,$B$13:$B$19,0)-1,0)","v":1699707.4800000002},1699707.4800000002,1803743.1754358404,1803743.1754358404,1803743.1754358404,1914146.6877179171,1914146.6877179171,1914146.6877179171,2031307.7781797554,2031307.7781797554,2031307.7781797554,2155640.0646665818,2155640.0646665818,2155640.0646665818,2287582.4817446941,2287582.4817446941,2287582.4817446941,2427600.8302873229,2427600.8302873229]
[]
{"$rows_left_out":44}
{"sheet":"Scarcity","index":12,"n_rows":37,"n_cols":23,"rows_kept":37,"cut":false,"hidden":false,"merged":[[2,2,2,3],[5,1,6,1]]}
[null,"Scarcity Adder"]
[]
[null,"Technology",{"$f":"'Controls & Results'!D8","v":"Battery - ORTP"}]
[]
[null,"Year",null,2026,{"$f":"D5+1","v":2027},{"$f":"E5+1","v":2028},2029,2030,2031,2032,2033,2034,2035,2036,2037,2038,2039,2040,2041,2042,2043,2044,2045]
[null,"ICAP","ICAP: 2025$",{"$f":"D7/(1+Assumptions!$D$36)^(D5-$D$5)","v":1087799.9999999998},{"$f":"E7/(1+Assumptions!$D$36)^(E5-$D$5)","v":1066470.588235294},{"$f":"F7/(1+Assumptions!$D$36)^(F5-$D$5)","v":1045559.4002306802},{"$f":"G7/(1+Assumptions!$D$36)^(G5-$D$5)","v":1025058.2355202748},{"$f":"H7/(1+Assumptions!$D$36)^(H5-$D$5)","v":1004959.0544316419},{"$f":"I7/(1+Assumptions!$D$36)^(I5-$D$5)","v":985253.97493298224},{"$f":"J7/(1+Assumptions!$D$36)^(J5-$D$5)","v":965935.26954213949},{"$f":"K7/(1+Assumptions!$D$36)^(K5-$D$5)","v":946995.36229621537},{"$f":"L7/(1+Assumptions!$D$36)^(L5-$D$5)","v":928426.82578060322},{"$f":"M7/(1+Assumptions!$D$36)^(M5-$D$5)","v":910222.37821627769},{"$f":"N7/(1+Assumptions!$D$36)^(N5-$D$5)","v":892374.88060419378},{"$f":"O7/(1+Assumptions!$D$36)^(O5-$D$5)","v":874877.33392568026},{"$f":"P7/(1+Assumptions!$D$36)^(P5-$D$5)","v":857722.87639772566},{"$f":"Q7/(1+Assumptions!$D$36)^(Q5-$D$5)","v":840904.78078208398},{"$f":"R7/(1+Assumptions!$D$36)^(R5-$D$5)","v":824416.45174714108},{"$f":"S7/(1+Assumptions!$D$36)^(S5-$D$5)","v":808251.42328151106},{"$f":"T7/(1+Assumptions!$D$36)^(T5-$D$5)","v":792403.35615834408},{"$f":"U7/(1+Assumptions!$D$36)^(U5-$D$5)","v":776866.03544935689},{"$f":"V7/(1+Assumptions!$D$36)^(V5-$D$5)","v":761633.36808760487},{"$f":"W7/(1+Assumptions!$D$36)^(W5-$D$5)","v":746699.38047804404}]
[null,null,"ICAP: Nominal",{"$f":"OFFSET(D11,MATCH($C$3,$B$11:$B$17,0)-1,0)","v":1087799.9999999998},{"$f":"OFFSET(E11,MATCH($C$3,$B$11:$B$17,0)-1,0)","v":1087799.9999999998},1087799.9999999998,1087799.9999999998,1087799.9999999998,1087799.9999999998,1087799.9999999998,1087799.9999999998,1087799.9999999998,1087799.9999999998,1087799.9999999998,1087799.9999999998,1087799.9999999998,1087799.9999999998,1087799.9999999998,1087799.9999999998,1087799.9999999998,1087799.9999999998,1087799.9999999998,1087799.9999999998]
[]
[]
[null,null,"Plant Capacity (MW)"]
{"$rows_left_out":28}
{"sheet":"MACRS","index":13,"n_rows":17,"n_cols":34,"rows_kept":17,"cut":false,"hidden":false,"merged":[[2,2,2,3]]}
[null,"MACRS"]
[]
[null,"Technology",{"$f":"'Controls & Results'!D8","v":"Battery - ORTP"}]
[]
[null,"Depreciation Schedule",{"$f":"Assumptions!D26","v":"7yrMACRS"}]
[]
[]
[null,null,"Year",2026,{"$f":"D8+1","v":2027},{"$f":"E8+1","v":2028},2029,2030,2031,2032,2033,2034,2035,2036,2037,2038,2039,2040,2041,2042,2043,2044,2045,2046,2047,2048,2049,2050,2051,2052,2053,2054,2055]
[null,null,"Depreciation Schedule",{"$f":"OFFSET(D11,MATCH($C$5,$C$12:$C$17,0),0)","v":0.1429},0.24490000000000001,0.1749,0.1249,8.9300000000000004E-2,8.9200000000000002E-2,8.9300000000000004E-2,4.4600000000000001E-2,0,0,0,0,0,0,0,0,0,0,0,0,0,0,0,0,0,0,0,0,0,0]
[]
{"$rows_left_out":8}
{"sheet":"Depreciation","index":14,"n_rows":79,"n_cols":22,"rows_kept":79,"cut":false,"hidden":false,"merged":[]}
[null,"Depreciation"]
[null,null,2026,{"$f":"C2+1","v":2027},{"$f":"D2+1","v":2028},2029,2030,2031,2032,2033,2034,2035,2036,2037,2038,2039,2040,2041,2042,{"$f":"S2+1","v":2043},2044,2045]
[null,"Depreciation Rate",{"$f":"MACRS!D9","v":0.1429},{"$f":"MACRS!E9","v":0.24490000000000001},{"$f":"MACRS!F9","v":0.1749},{"$f":"MACRS!G9","v":0.1249},{"$f":"MACRS!H9","v":8.9300000000000004E-2},{"$f":"MACRS!I9","v":8.9200000000000002E-2},{"$f":"MACRS!J9","v":8.9300000000000004E-2},{"$f":"MACRS!K9","v":4.4600000000000001E-2},{"$f":"MACRS!L9","v":0},{"$f":"MACRS!M9","v":0},{"$f":"MACRS!N9","v":0},{"$f":"MACRS!O9","v":0},{"$f":"MACRS!P9","v":0},{"$f":"MACRS!Q9","v":0},{"$f":"MACRS!R9","v":0},{"$f":"MACRS!S9","v":0},{"$f":"MACRS!T9","v":0},{"$f":"MACRS!U9","v":0},{"$f":"MACRS!V9","v":0},{"$f":"MACRS!W9","v":0}]
[]
[null,"CAPEX SCHEDULE",0,0,0,0,0,0,0,0,0,0,0,0,0,0,0,0,0,0,0,0]
[]
[null,"Beginning Plant ",{"$f":"'Construction CF'!B45","v":135693025.47077197}]
[null,"ITC Reduced Plant Basis",{"$f":"C7*(1-Assumptions!$D$21/2)","v":135693025.47077197}]
[null,"Bonus Depreciation",{"$f":"Assumptions!$D$27*Depreciation!C8","v":27138605.094154395}]
[null,"Beginning Plant MACRS",{"$f":"C8-C9","v":108554420.37661758}]
{"$rows_left_out":69}